BDBM50014193 2-Benzoyl-5-hydroxy-hexa-2,4-dienedioic acid diethyl ester::CHEMBL94220
SMILES CCOC(=O)C(=O)CC=C(C(=O)OCC)C(=O)c1ccccc1
InChI Key InChIKey=NCPRNNGYYHDZDL-UHFFFAOYSA-N
Data  3 IC50
  Tab Delimited (TSV)   2D SDfile   Computed 3D by Vconf -m prep SDfile
Find this compound or compounds like it in BindingDB:
Activity Spreadsheet -- Enzyme Inhibition Constant Data from BindingDB
Found 3 hits for monomerid = 50014193
TargetPolyunsaturated fatty acid 5-lipoxygenase(Rattus norvegicus)
Centre De Recherches De Vitry
Curated by ChEMBL
LigandPNGBDBM50014193(2-Benzoyl-5-hydroxy-hexa-2,4-dienedioic acid dieth...)
Affinity DataIC50: >5.00E+4nM. Assay description: Iin vitro inhibition of 5-lipoxygenase activity in rat basophil leukemia type 1(RBL1) cell homogenates, (reduction of [14C]-5-HETE formation)
In DepthDetails ArticlePubMed
TargetPolyunsaturated fatty acid 5-lipoxygenase(Rattus norvegicus)
Centre De Recherches De Vitry
Curated by ChEMBL
LigandPNGBDBM50014193(2-Benzoyl-5-hydroxy-hexa-2,4-dienedioic acid dieth...)
Affinity DataIC50: >5.00E+4nM. Assay description: In vitro inhibitory activity against 5-Lipoxygenase in rat by Peritoneal 5-lipoxygenase assay
In DepthDetails ArticlePubMed
TargetProstaglandin G/H synthase 1/2(RAT)
Centre De Recherches De Vitry
Curated by ChEMBL
LigandPNGBDBM50014193(2-Benzoyl-5-hydroxy-hexa-2,4-dienedioic acid dieth...)
Affinity DataIC50: >5.00E+4nM. Assay description: In vitro inhibition of 5-lipoxygenase in rat (peritoneal assay)
In DepthDetails ArticlePubMed