BDBM50014750 3-[Bis-(4-chloro-phenyl)-imidazol-1-yl-methyl]-pyridine::CHEMBL137049
SMILES Clc1ccc(cc1)C(c1ccc(Cl)cc1)(c1cccnc1)n1ccnc1
InChI Key InChIKey=UFVDWGWXQCGMKB-UHFFFAOYSA-N
Data  1 EC50
  Tab Delimited (TSV)   2D SDfile   Computed 3D by Vconf -m prep SDfile
Find this compound or compounds like it in BindingDB:
Activity Spreadsheet -- Enzyme Inhibition Constant Data from BindingDB
Found 1 hit for monomerid = 50014750
TargetAromatase(Rattus norvegicus)
Eli Lilly
Curated by ChEMBL
LigandPNGBDBM50014750(3-[Bis-(4-chloro-phenyl)-imidazol-1-yl-methyl]-pyr...)
Affinity DataEC50:  50nM. Assay description: In vitro Cytochrome P450 19A1 inhibition concentration to decrease aromatization of androstenedione in rat ovarian microsome
In DepthDetails ArticlePubMed