BDBM50014755 1-[Bis-(4-methoxy-phenyl)-methyl]-1H-imidazole::CHEMBL135494
SMILES COc1ccc(cc1)C(c1ccc(OC)cc1)n1ccnc1
InChI Key InChIKey=RJDZAWKSEGPSMJ-UHFFFAOYSA-N
Data  1 EC50
  Tab Delimited (TSV)   2D SDfile   Computed 3D by Vconf -m prep SDfile
Find this compound or compounds like it in BindingDB:
Activity Spreadsheet -- Enzyme Inhibition Constant Data from BindingDB
Found 1 hit for monomerid = 50014755
TargetAromatase(Rattus norvegicus)
Eli Lilly
Curated by ChEMBL
LigandPNGBDBM50014755(1-[Bis-(4-methoxy-phenyl)-methyl]-1H-imidazole | C...)
Affinity DataEC50:  13nM. Assay description: In vitro Cytochrome P450 19A1 inhibition concentration to decrease aromatization of androstenedione in rat ovarian microsome
In DepthDetails ArticlePubMed