BDBM50014784 (4-Chloro-phenyl)-pyridin-3-yl-(3-trifluoromethyl-phenyl)-methanol : (Hydrochloride)::CHEMBL337750
SMILES OC(c1ccc(Cl)cc1)(c1cccnc1)c1cccc(c1)C(F)(F)F
InChI Key InChIKey=VAFIUNNEDCNHDT-UHFFFAOYSA-N
Data  1 EC50
  Tab Delimited (TSV)   2D SDfile   Computed 3D by Vconf -m prep SDfile
Find this compound or compounds like it in BindingDB:
Activity Spreadsheet -- Enzyme Inhibition Constant Data from BindingDB
Found 1 hit for monomerid = 50014784
TargetAromatase(Rattus norvegicus)
Eli Lilly
Curated by ChEMBL
LigandPNGBDBM50014784((4-Chloro-phenyl)-pyridin-3-yl-(3-trifluoromethyl-...)
Affinity DataEC50:  650nM. Assay description: In vitro Cytochrome P450 19A1 inhibition concentration to decrease aromatization of androstenedione in rat ovarian microsome
In DepthDetails ArticlePubMed