BDBM50014795 3-[Bis-(4-chloro-phenyl)-methoxy-methyl]-pyridine::CHEMBL133082
SMILES COC(c1ccc(Cl)cc1)(c1ccc(Cl)cc1)c1cccnc1
InChI Key InChIKey=LXQWWLANZWFJBQ-UHFFFAOYSA-N
Data  1 EC50
  Tab Delimited (TSV)   2D SDfile   Computed 3D by Vconf -m prep SDfile
Find this compound or compounds like it in BindingDB:
Activity Spreadsheet -- Enzyme Inhibition Constant Data from BindingDB
Found 1 hit for monomerid = 50014795
TargetAromatase(Rattus norvegicus)
Eli Lilly
Curated by ChEMBL
LigandPNGBDBM50014795(3-[Bis-(4-chloro-phenyl)-methoxy-methyl]-pyridine ...)
Affinity DataEC50:  1.60E+3nM. Assay description: In vitro Cytochrome P450 19A1 inhibition concentration to decrease aromatization of androstenedione in rat ovarian microsome
In DepthDetails ArticlePubMed