BDBM50015543 CHEMBL3265332
SMILES [H][C@@]12COCC[C@@]1([H])[C@]1(COC(N)=N1)c1cc(ccc1O2)-c1cncc(F)c1
InChI Key InChIKey=JRUOFHMDUURXCL-LSBZLQRGSA-N
Data  2 IC50
  Tab Delimited (TSV)   2D SDfile   Computed 3D by Vconf -m prep SDfile
Find this compound or compounds like it in BindingDB:
Activity Spreadsheet -- Enzyme Inhibition Constant Data from BindingDB
Found 2 hits for monomerid = 50015543
TargetBeta-secretase 1(Homo sapiens (Human))
Genentech
Curated by ChEMBL
LigandPNGBDBM50015543(CHEMBL3265332)
Affinity DataIC50:  360nM. Assay description: Inhibition of BACE1 (unknown origin)
In DepthDetails ArticlePubMed
TargetBeta-secretase 1(Homo sapiens (Human))
Genentech
Curated by ChEMBL
LigandPNGBDBM50015543(CHEMBL3265332)
Affinity DataIC50:  90nM. Assay description: Inhibition of BACE1 (unknown origin) assessed as amyloid beta production wild type APP expressing by cell based assay
In DepthDetails ArticlePubMed