BDBM50015569 CHEMBL1242276
SMILES Clc1ccc(cc1)-c1nn(cc1-c1nnc(o1)-c1ccccc1)-c1ccccc1
InChI Key InChIKey=KVVMAYJPPJIIFO-UHFFFAOYSA-N
Data  2 IC50
  Tab Delimited (TSV)   2D SDfile   Computed 3D by Vconf -m prep SDfile
Find this compound or compounds like it in BindingDB:
Activity Spreadsheet -- Enzyme Inhibition Constant Data from BindingDB
Found 2 hits for monomerid = 50015569
TargetProstaglandin G/H synthase 2(Homo sapiens (Human))
Shoolini University
Curated by ChEMBL
LigandPNGBDBM50015569(CHEMBL1242276)
Affinity DataIC50:  4.70E+3nM. Assay description: Inhibition of human recombinant COX2 after 2 mins by EIA
In DepthDetails ArticlePubMed
TargetProstaglandin G/H synthase 1(Ovis aries (Sheep))
Shoolini University
Curated by ChEMBL
LigandPNGBDBM50015569(CHEMBL1242276)
Affinity DataIC50: >1.00E+5nM. Assay description: Inhibition of ovine COX1 after 2 mins by EIA
In DepthDetails ArticlePubMed