BDBM50017317 CHEMBL3288003
SMILES Oc1ccc(c(CN2CCOCC2)c1)-c1cccc(Oc2ncc(F)cc2C(=O)N[C@H]2CC[C@H](CC2)NC(=O)c2ncccc2O)c1
InChI Key InChIKey=UEDFRNFASVBNTC-WMPKNSHKSA-N
Data  1 IC50
  Tab Delimited (TSV)   2D SDfile   Computed 3D by Vconf -m prep SDfile
Find this compound or compounds like it in BindingDB:
Activity Spreadsheet -- Enzyme Inhibition Constant Data from BindingDB
Found 1 hit for monomerid = 50017317
TargetcAMP-specific 3',5'-cyclic phosphodiesterase 4B(Homo sapiens (Human))
Astrazeneca
Curated by ChEMBL
LigandPNGBDBM50017317(CHEMBL3288003)
Affinity DataIC50:  0.126nM. Assay description: Inhibition of human recombinant PDE4B using [3H]cAMP by packard topcount scintillation counting analysis
In DepthDetails ArticlePubMed