BDBM50019296 CHEMBL3289396
SMILES Nc1ncnc2n(cnc12)[C@@H]1O[C@H](COP(O)(=O)CP(O)(=O)OP(O)(O)=S)[C@@H](O)[C@H]1O
InChI Key InChIKey=CJFOFYSODKGYDA-IOSLPCCCSA-N
Data  1 KI  1 IC50
  Tab Delimited (TSV)   2D SDfile   Computed 3D by Vconf -m prep SDfile
Find this compound or compounds like it in BindingDB:
Activity Spreadsheet -- Enzyme Inhibition Constant Data from BindingDB
Found 2 hits for monomerid = 50019296
TargetEctonucleotide pyrophosphatase/phosphodiesterase family member 1(Homo sapiens (Human))
Bar-Ilan University
Curated by ChEMBL
LigandPNGBDBM50019296(CHEMBL3289396)
Affinity DataKi:  20nM. Assay description: Mixed type inhibition of human NPP1 using pNP-TMP as substrate after 20 mins by Dixon and Cornish-Bowden method
In DepthDetails ArticlePubMed
TargetEctonucleotide pyrophosphatase/phosphodiesterase family member 1(Homo sapiens (Human))
Bar-Ilan University
Curated by ChEMBL
LigandPNGBDBM50019296(CHEMBL3289396)
Affinity DataIC50:  390nM. Assay description: Mixed type inhibition of human NPP1 using pNP-TMP as substrate after 20 mins by Dixon and Cornish-Bowden method
In DepthDetails ArticlePubMed