BDBM50019427 3-(4-Fluoro-phenyl)-3-methyl-1-[3-(4-pyrimidin-2-yl-piperazin-1-yl)-propyl]-pyrrolidine-2,5-dione::CHEMBL416408
SMILES CC1(CC(=O)N(CCCN2CCN(CC2)c2ncccn2)C1=O)c1ccc(F)cc1
InChI Key InChIKey=MAMCILWMZSICJV-UHFFFAOYSA-N
Data  1 IC50
  Tab Delimited (TSV)   2D SDfile   Computed 3D by Vconf -m prep SDfile
Find this compound or compounds like it in BindingDB:
Activity Spreadsheet -- Enzyme Inhibition Constant Data from BindingDB
Found 1 hit for monomerid = 50019427
TargetD(2) dopamine receptor(Rattus norvegicus (rat))
TBA
Curated by ChEMBL
LigandPNGBDBM50019427(3-(4-Fluoro-phenyl)-3-methyl-1-[3-(4-pyrimidin-2-y...)
Affinity DataIC50: >1.00E+3nM. Assay description: Binding affinity at Dopamine receptor D2 in rat corpus striatum by displacing [3H]-spiperone.
In DepthDetails ArticlePubMed