BDBM50019435 5,6-Dichloro-2-[4-(4-pyrimidin-2-yl-piperazin-1-yl)-butyl]-isoindole-1,3-dione::CHEMBL287604
SMILES Clc1cc2C(=O)N(CCCCN3CCN(CC3)c3ncccn3)C(=O)c2cc1Cl
InChI Key InChIKey=DRCSETNTACRVAJ-UHFFFAOYSA-N
Data  1 IC50
  Tab Delimited (TSV)   2D SDfile   Computed 3D by Vconf -m prep SDfile
Find this compound or compounds like it in BindingDB:
Activity Spreadsheet -- Enzyme Inhibition Constant Data from BindingDB
Found 1 hit for monomerid = 50019435
TargetD(2) dopamine receptor(Rattus norvegicus (rat))
TBA
Curated by ChEMBL
LigandPNGBDBM50019435(5,6-Dichloro-2-[4-(4-pyrimidin-2-yl-piperazin-1-yl...)
Affinity DataIC50: >1.00E+3nM. Assay description: Binding affinity at Dopamine receptor D2 in rat corpus striatum by displacing [3H]-spiperone.
In DepthDetails ArticlePubMed