BDBM50019438 3,3-Diphenyl-1-[4-(4-pyrimidin-2-yl-piperazin-1-yl)-butyl]-pyrrolidine-2,5-dione::CHEMBL285878
SMILES O=C1CC(C(=O)N1CCCCN1CCN(CC1)c1ncccn1)(c1ccccc1)c1ccccc1
InChI Key InChIKey=IFVHVXAOZIGOLZ-UHFFFAOYSA-N
Data  1 IC50
  Tab Delimited (TSV)   2D SDfile   Computed 3D by Vconf -m prep SDfile
Find this compound or compounds like it in BindingDB:
Activity Spreadsheet -- Enzyme Inhibition Constant Data from BindingDB
Found 1 hit for monomerid = 50019438
TargetD(2) dopamine receptor(Rattus norvegicus (rat))
TBA
Curated by ChEMBL
LigandPNGBDBM50019438(3,3-Diphenyl-1-[4-(4-pyrimidin-2-yl-piperazin-1-yl...)
Affinity DataIC50: >1.00E+3nM. Assay description: Binding affinity at Dopamine receptor D2 in rat corpus striatum by displacing [3H]-spiperone.
In DepthDetails ArticlePubMed