BDBM50020820 CHEMBL112922::[(5-Chloro-2-mercapto-benzoyl)-cyclopentyl-amino]-acetic acid
SMILES OC(=O)CN(C1CCCC1)C(=O)c1cc(Cl)ccc1S
InChI Key InChIKey=LWDQWWDKLSPGNO-UHFFFAOYSA-N
Data  1 IC50
  Tab Delimited (TSV)   2D SDfile   Computed 3D by Vconf -m prep SDfile
Find this compound or compounds like it in BindingDB:
Activity Spreadsheet -- Enzyme Inhibition Constant Data from BindingDB
Found 1 hit for monomerid = 50020820
TargetAngiotensin-converting enzyme(Oryctolagus cuniculus)
TBA
Curated by ChEMBL
LigandPNGBDBM50020820(CHEMBL112922 | [(5-Chloro-2-mercapto-benzoyl)-cycl...)
Affinity DataIC50:  0.0800nM. Assay description: In vitro inhibitory activity against Angiotensin I converting enzyme
In DepthDetails ArticlePubMed