BDBM50023545 2,2-Dimethyl-propionic acid 4-[4-(2,2-dimethyl-propionyloxy)-benzoyl]-phenyl ester::CHEMBL10541
SMILES CC(C)(C)C(=O)Oc1ccc(cc1)C(=O)c1ccc(OC(=O)C(C)(C)C)cc1
InChI Key InChIKey=KTYGBVWDYRYTSS-UHFFFAOYSA-N
Data  1 KI  1 IC50
  Tab Delimited (TSV)   2D SDfile   Computed 3D by Vconf -m prep SDfile
Find this compound or compounds like it in BindingDB:
Activity Spreadsheet -- Enzyme Inhibition Constant Data from BindingDB
Found 2 hits for monomerid = 50023545
TargetNeutrophil elastase(Homo sapiens (Human))
Searle Research And Development
Curated by ChEMBL
LigandPNGBDBM50023545(2,2-Dimethyl-propionic acid 4-[4-(2,2-dimethyl-pro...)
Affinity DataKi:  71nM. Assay description: Binding affinity towards human leukocyte elastase at 10e-8 M
In DepthDetails ArticlePubMed
TargetNeutrophil elastase(Homo sapiens (Human))
Searle Research And Development
Curated by ChEMBL
LigandPNGBDBM50023545(2,2-Dimethyl-propionic acid 4-[4-(2,2-dimethyl-pro...)
Affinity DataIC50:  120nM. Assay description: Inhibitory activity against human leukocyte elastase at 10e-8 M
In DepthDetails ArticlePubMed