BDBM50025158 2-Amino-3-methyl-4-methylsulfanyl-butyric acid::CHEMBL291210
SMILES CSCC(C)C(N)C(O)=O
InChI Key InChIKey=JNHATNWAMGXQJQ-UHFFFAOYSA-N
Data  2 KI
  Tab Delimited (TSV)   2D SDfile   Computed 3D by Vconf -m prep SDfile
Find this compound or compounds like it in BindingDB:
Activity Spreadsheet -- Enzyme Inhibition Constant Data from BindingDB
Found 2 hits for monomerid = 50025158
TargetS-adenosylmethionine synthase isoform type-1/type-2(Rattus norvegicus)
TBA
Curated by ChEMBL
LigandPNGBDBM50025158(2-Amino-3-methyl-4-methylsulfanyl-butyric acid | C...)
Affinity DataKi:  5.00E+5nM. Assay description: Competitive inhibitory activity against methionine adenosyltransferase
In DepthDetails ArticlePubMed
TargetS-adenosylmethionine synthase isoform type-2(Rattus norvegicus)
TBA
Curated by ChEMBL
LigandPNGBDBM50025158(2-Amino-3-methyl-4-methylsulfanyl-butyric acid | C...)
Affinity DataKi:  5.00E+5nM. Assay description: Competitive inhibitory activity against Methionine adenosyltransferase II
In DepthDetails ArticlePubMed