BDBM50025452 (testosterone)17-Hydroxy-10,13-dimethyl-1,2,6,7,8,9,10,11,12,13,14,15,16,17-tetradecahydro-cyclopenta[a]phenanthren-3-one::14-hydroxy-2,15-dimethyltetracyclo[8.7.0.02,7.011,15]heptadec-6-en-5-one::17-Hydroxy-10,13-dimethyl-1,2,6,7,8,9,10,11,12,13,14,15,16,17-tetradecahydro-cyclopenta[a]phenanthren-3-one::17-Hydroxy-10,13-dimethyl-1,2,6,7,8,9,10,11,12,13,14,15,16,17-tetradecahydro-cyclopenta[a]phenanthren-3-one (Testosterone)::17-Hydroxy-10,13-dimethyl-1,2,6,7,8,9,10,11,12,13,14,15,16,17-tetradecahydro-cyclopenta[a]phenanthren-3-one(testosterone)::CHEMBL386630::testosterone
SMILES CC12CCC3C(CCC4=CC(=O)CCC34C)C1CCC2O
InChI Key InChIKey=MUMGGOZAMZWBJJ-UHFFFAOYSA-N
Data  1 KI
PDB links: 3 PDB IDs match this monomer.
  Tab Delimited (TSV)   2D SDfile   Computed 3D by Vconf -m prep SDfile
Find this compound or compounds like it in BindingDB:
Activity Spreadsheet -- Enzyme Inhibition Constant Data from BindingDB
Found 1 hit for monomerid = 50025452
TargetAndrogen receptor(Rattus norvegicus (Rat))
Meiji Seika Kaisha
Curated by PDSP Ki Database
LigandPNGBDBM50025452((testosterone)17-Hydroxy-10,13-dimethyl-1,2,6,7,8,...)
Affinity DataKi:  6.30nM
In DepthDetails ArticlePubMedMMDB