BDBM50025789 1-(3-Chloro-benzyl)-1,3-dihydro-imidazole-2-thione::CHEMBL65687
SMILES Clc1cccc(Cn2cc[nH]c2=S)c1
InChI Key InChIKey=FRNBUOASTZWRQU-UHFFFAOYSA-N
Data  4 IC50
  Tab Delimited (TSV)   2D SDfile   Computed 3D by Vconf -m prep SDfile
Find this compound or compounds like it in BindingDB:
Activity Spreadsheet -- Enzyme Inhibition Constant Data from BindingDB
Found 4 hits for monomerid = 50025789
TargetDopamine beta-hydroxylase(Bos taurus)
TBA
Curated by ChEMBL
LigandPNGBDBM50025789(1-(3-Chloro-benzyl)-1,3-dihydro-imidazole-2-thione...)
Affinity DataIC50:  1.20E+4nM. Assay description: Inhibitory Concentration against bovine Dopamine beta hydroxylase (DBH); Range is between (10-14).
In DepthDetails ArticlePubMed
TargetDopamine beta-hydroxylase(Homo sapiens (Human))
Molecular Simulations
Curated by ChEMBL
LigandPNGBDBM50025789(1-(3-Chloro-benzyl)-1,3-dihydro-imidazole-2-thione...)
Affinity DataIC50:  1.20E+4nM. Assay description: Inhibition of dopamine beta hydroxylase
In DepthDetails ArticlePubMed
TargetDopamine beta-hydroxylase(Homo sapiens (Human))
Molecular Simulations
Curated by ChEMBL
LigandPNGBDBM50025789(1-(3-Chloro-benzyl)-1,3-dihydro-imidazole-2-thione...)
Affinity DataIC50:  1.20E+4nM. Assay description: Inhibition of dopamine beta-hydroxylase (DbetaH) enzyme
In DepthDetails ArticlePubMed
TargetDopamine beta-hydroxylase(Rattus norvegicus)
University Of Illinois
Curated by ChEMBL
LigandPNGBDBM50025789(1-(3-Chloro-benzyl)-1,3-dihydro-imidazole-2-thione...)
Affinity DataIC50:  1.20E+4nM. Assay description: Inhibition of dopamine beta-hydroxylase (DbetaH) in hypertensive rats when administered orally (or) intraperitoneally
In DepthDetails ArticlePubMed