BDBM50025853 CHEMBL3330900
SMILES [#6]-[#8]-c1ccc(cc1)-[#6](=[#7]\[#7]-[#6](=O)-[#7]-[#7]-[#6](=O)-[#7]-[#6]-[#6]-[#6]-[#6](-[#6])-[#7]-c1cc(-[#8]-[#6])cc2cccnc12)\c1ccc(-[#8]-[#6])cc1
InChI Key InChIKey=UHBXFYHKZIWKRI-UHFFFAOYSA-N
Data  1 IC50
  Tab Delimited (TSV)   2D SDfile   Computed 3D by Vconf -m prep SDfile
Find this compound or compounds like it in BindingDB:
Activity Spreadsheet -- Enzyme Inhibition Constant Data from BindingDB
Found 1 hit for monomerid = 50025853
TargetLipoxygenase(Glycine max)
University Of Zagreb
Curated by ChEMBL
LigandPNGBDBM50025853(CHEMBL3330900)
Affinity DataIC50:  7.50E+4nM. Assay description: Inhibition of soybean LOX using sodium linoleate as substrate by spectrophotometry
In DepthDetails ArticlePubMed