BDBM50025866 CHEMBL60695::N-[1R-(2-phenyl ethyl)]benzamide difluoroborane
SMILES FB(F)[C@H](Cc1ccccc1)NC(=O)c1ccccc1
InChI Key InChIKey=DBMNDVGIIAMSTI-AWEZNQCLSA-N
Data  1 KI
  Tab Delimited (TSV)   2D SDfile   Computed 3D by Vconf -m prep SDfile
Find this compound or compounds like it in BindingDB:
Activity Spreadsheet -- Enzyme Inhibition Constant Data from BindingDB
Found 1 hit for monomerid = 50025866
TargetChymotrypsinogen B(Homo sapiens (Human))
TBA
Curated by ChEMBL
LigandPNGBDBM50025866(CHEMBL60695 | N-[1R-(2-phenyl ethyl)]benzamide dif...)
Affinity DataKi:  270nM. Assay description: Competetive inhibition of alpha-chymotrypsin
In DepthDetails ArticlePubMed