BDBM50025868 2-Amino-N-(2-phenyl ethyl)propanamide difluoroborane::CHEMBL294879
SMILES CC(N)C(=O)NC(Cc1ccccc1)B(F)F
InChI Key InChIKey=KPQISZKOTPKWCQ-UHFFFAOYSA-N
Data  1 KI
  Tab Delimited (TSV)   2D SDfile   Computed 3D by Vconf -m prep SDfile
Find this compound or compounds like it in BindingDB:
Activity Spreadsheet -- Enzyme Inhibition Constant Data from BindingDB
Found 1 hit for monomerid = 50025868
TargetChymotrypsinogen B(Homo sapiens (Human))
TBA
Curated by ChEMBL
LigandPNGBDBM50025868(2-Amino-N-(2-phenyl ethyl)propanamide difluorobora...)
Affinity DataKi:  1.40E+3nM. Assay description: Competetive inhibition of alpha-chymotrypsin
In DepthDetails ArticlePubMed