BDBM50025869 CHEMBL3330913
SMILES COc1cc(NC(C)CCCNC(=O)NCCNC(c2ccccc2)(c2ccccc2)c2ccccc2)c2ncccc2c1
InChI Key InChIKey=PEUAJGPWAFZYPN-UHFFFAOYSA-N
Data  1 IC50
  Tab Delimited (TSV)   2D SDfile   Computed 3D by Vconf -m prep SDfile
Find this compound or compounds like it in BindingDB:
Activity Spreadsheet -- Enzyme Inhibition Constant Data from BindingDB
Found 1 hit for monomerid = 50025869
TargetLipoxygenase(Glycine max)
University Of Zagreb
Curated by ChEMBL
LigandPNGBDBM50025869(CHEMBL3330913)
Affinity DataIC50:  9.30E+4nM. Assay description: Inhibition of soybean LOX using sodium linoleate as substrate by spectrophotometry
In DepthDetails ArticlePubMed