BDBM50027226 3-Methyl-1,2,3,4,4a,8-hexahydro-7-thia-3,12b-diaza-dibenzo[e,g]azulene::CHEMBL13644
SMILES CN1CCN2C(C1)c1ccsc1Cc1ccccc21
InChI Key InChIKey=NMVGXBXUDFUBCN-UHFFFAOYSA-N
Data  5 IC50
  Tab Delimited (TSV)   2D SDfile   Computed 3D by Vconf -m prep SDfile
Find this compound or compounds like it in BindingDB:
Activity Spreadsheet -- Enzyme Inhibition Constant Data from BindingDB
Found 5 hits for monomerid = 50027226
TargetHistamine H2 receptor(Cavia porcellus (domestic guinea pig))
TBA
Curated by ChEMBL
LigandPNGBDBM50027226(3-Methyl-1,2,3,4,4a,8-hexahydro-7-thia-3,12b-diaza...)
Affinity DataIC50:  7.20E+3nM. Assay description: In vitro antihistamine activity by activation of 4-methylhistamine mediated by Histamine H2 receptor
In DepthDetails ArticlePubMed
LigandPNGBDBM50027226(3-Methyl-1,2,3,4,4a,8-hexahydro-7-thia-3,12b-diaza...)
Affinity DataIC50:  2nM. Assay description: In vitro binding affinity towards alpha-adrenoceptor of calf cortex membrane Site A using [3H]clonidine
In DepthDetails ArticlePubMed
LigandPNGBDBM50027226(3-Methyl-1,2,3,4,4a,8-hexahydro-7-thia-3,12b-diaza...)
Affinity DataIC50:  3nM. Assay description: In vitro binding affinity towards alpha-adrenoceptor of calf cortex membrane Site B using [3H]-clonidine
In DepthDetails ArticlePubMed
LigandPNGBDBM50027226(3-Methyl-1,2,3,4,4a,8-hexahydro-7-thia-3,12b-diaza...)
Affinity DataIC50:  300nM. Assay description: In vitro binding affinity towards alpha-adreno ceptor of rat forebrain using [3H]prazosin
In DepthDetails ArticlePubMed
LigandPNGBDBM50027226(3-Methyl-1,2,3,4,4a,8-hexahydro-7-thia-3,12b-diaza...)
Affinity DataIC50:  100nM. Assay description: In vitro binding affinity of alpha-adrenoceptor by interacting with high affinity, [3H]serotonin from calf caudate nucleus
In DepthDetails ArticlePubMed