BDBM50027773 CHEMBL264319
SMILES CCCc1nn(C)c2c1nc([nH]c2=O)-c1cc(ccc1OCC)S(=O)(=O)N1CCC(CCCC(O)=O)CC1
InChI Key InChIKey=NGOQJWHOACWDGX-UHFFFAOYSA-N
Data  1 IC50
  Tab Delimited (TSV)   2D SDfile   Computed 3D by Vconf -m prep SDfile
Find this compound or compounds like it in BindingDB:
Activity Spreadsheet -- Enzyme Inhibition Constant Data from BindingDB
Found 1 hit for monomerid = 50027773
TargetcGMP-specific 3',5'-cyclic phosphodiesterase(Homo sapiens (Human))
Sungkyunkwan University
Curated by ChEMBL
LigandPNGBDBM50027773(CHEMBL264319)
Affinity DataIC50:  0.219nM. Assay description: Inhibition of PDE5
In DepthDetails ArticlePubMed