BDBM50029107 8-Chloro-1,2,3,4-tetrahydro-isoquinoline::CHEMBL146188
SMILES Clc1cccc2CCNCc12
InChI Key InChIKey=HQSAGIBNZOOQQL-UHFFFAOYSA-N
Data  1 KI  1 IC50
  Tab Delimited (TSV)   2D SDfile   Computed 3D by Vconf -m prep SDfile
Find this compound or compounds like it in BindingDB:
Activity Spreadsheet -- Enzyme Inhibition Constant Data from BindingDB
Found 2 hits for monomerid = 50029107
TargetPhenylethanolamine N-methyltransferase(Homo sapiens (Human))
TBA
Curated by ChEMBL
LigandPNGBDBM50029107(8-Chloro-1,2,3,4-tetrahydro-isoquinoline | CHEMBL1...)
Affinity DataKi:  30nM. Assay description: In vitro inhibitory potency of the compound was measured against phenylethanolamine N-methyltransferase
In DepthDetails ArticlePubMed
TargetPhenylethanolamine N-methyltransferase(Homo sapiens (Human))
TBA
Curated by ChEMBL
LigandPNGBDBM50029107(8-Chloro-1,2,3,4-tetrahydro-isoquinoline | CHEMBL1...)
Affinity DataIC50:  200nM. Assay description: In vitro inhibitory potency of the compound was measured against phenylethanolamine N-methyltransferase
In DepthDetails ArticlePubMed