BDBM50029108 6,7,8-Trichloro-1,2,3,4-tetrahydro-isoquinoline::CHEMBL356439
SMILES Clc1cc2CCNCc2c(Cl)c1Cl
InChI Key InChIKey=DYLOZSJRCGMHPX-UHFFFAOYSA-N
Data  1 KI  1 IC50
  Tab Delimited (TSV)   2D SDfile   Computed 3D by Vconf -m prep SDfile
Find this compound or compounds like it in BindingDB:
Activity Spreadsheet -- Enzyme Inhibition Constant Data from BindingDB
Found 2 hits for monomerid = 50029108
TargetPhenylethanolamine N-methyltransferase(Homo sapiens (Human))
TBA
Curated by ChEMBL
LigandPNGBDBM50029108(6,7,8-Trichloro-1,2,3,4-tetrahydro-isoquinoline | ...)
Affinity DataKi:  20nM. Assay description: In vitro inhibitory potency of the compound was measured against phenylethanolamine N-methyltransferase
In DepthDetails ArticlePubMed
TargetPhenylethanolamine N-methyltransferase(Homo sapiens (Human))
TBA
Curated by ChEMBL
LigandPNGBDBM50029108(6,7,8-Trichloro-1,2,3,4-tetrahydro-isoquinoline | ...)
Affinity DataIC50:  100nM. Assay description: In vitro inhibitory potency of the compound was measured against phenylethanolamine N-methyltransferase
In DepthDetails ArticlePubMed