BDBM50029244 1-{5-[4-(2-Methoxy-phenyl)-piperazin-1-ylmethyl]-furan-2-ylmethyl}-azocan-2-one;succinate
SMILES COc1ccccc1N1CCN(Cc2ccc(CN3CCCCCCC3=O)o2)CC1
InChI Key InChIKey=FARTWIHPHUYFOY-UHFFFAOYSA-N
Data  2 KI
  Tab Delimited (TSV)   2D SDfile   Computed 3D by Vconf -m prep SDfile
Find this compound or compounds like it in BindingDB:
Activity Spreadsheet -- Enzyme Inhibition Constant Data from BindingDB
Found 2 hits for monomerid = 50029244
Target5-hydroxytryptamine receptor 1A(Rattus norvegicus (rat))
R. W. Johnson Pharmaceutical Research Institute
Curated by ChEMBL
LigandPNGBDBM50029244(1-{5-[4-(2-Methoxy-phenyl)-piperazin-1-ylmethyl]-f...)
Affinity DataKi:  32nM. Assay description: Binding affinity was determined against 5-hydroxytryptamine 1A receptor using [3H]WB-4101
In DepthDetails ArticlePubMed
TargetD(2) dopamine receptor(Rattus norvegicus (rat))
R. W. Johnson Pharmaceutical Research Institute
Curated by ChEMBL
LigandPNGBDBM50029244(1-{5-[4-(2-Methoxy-phenyl)-piperazin-1-ylmethyl]-f...)
Affinity DataKi:  1.43E+3nM. Assay description: Binding affinity was determined against Dopamine receptor D2 using [3H]spiperone
In DepthDetails ArticlePubMed