BDBM50029293 N-Benzyl-N-{5-[4-(2-methoxy-phenyl)-piperazin-1-ylmethyl]-1-methyl-1H-pyrrol-2-ylmethyl}-acetamide;succinate
SMILES COc1ccccc1N1CCN(Cc2ccc(CN(Cc3ccccc3)C(C)=O)n2C)CC1
InChI Key InChIKey=GYDBESXMPQTKHX-UHFFFAOYSA-N
Data  1 KI
  Tab Delimited (TSV)   2D SDfile   Computed 3D by Vconf -m prep SDfile
Find this compound or compounds like it in BindingDB:
Activity Spreadsheet -- Enzyme Inhibition Constant Data from BindingDB
Found 1 hit for monomerid = 50029293
TargetD(2) dopamine receptor(Rattus norvegicus (rat))
R. W. Johnson Pharmaceutical Research Institute
Curated by ChEMBL
LigandPNGBDBM50029293(N-Benzyl-N-{5-[4-(2-methoxy-phenyl)-piperazin-1-yl...)
Affinity DataKi: >30nM. Assay description: Binding affinity was determined against Dopamine receptor D2 using [3H]spiperone
In DepthDetails ArticlePubMed