BDBM50033093 CHEMBL3342963
SMILES OC(=O)CCCN1C[C@@H](Oc2c(NC(=O)c3ccc(OCCCCc4ccccc4)cc3)cccc12)C(O)=O
InChI Key InChIKey=CCNFJZLJCWVIGY-AREMUKBSSA-N
Data  2 IC50
  Tab Delimited (TSV)   2D SDfile   Computed 3D by Vconf -m prep SDfile
Find this compound or compounds like it in BindingDB:
Activity Spreadsheet -- Enzyme Inhibition Constant Data from BindingDB
Found 2 hits for monomerid = 50033093
TargetCysteinyl leukotriene receptor 1(Homo sapiens (Human))
Ono Pharmaceutical
Curated by ChEMBL
LigandPNGBDBM50033093(CHEMBL3342963)
Affinity DataIC50:  51nM. Assay description: Antagonist activity at human CysLT1 receptor expressed in CHO cells assessed as inhibition of LTD4-inudced intracellular calcium influx preincubated ...
In DepthDetails ArticlePubMed
TargetCysteinyl leukotriene receptor 2(Homo sapiens (Human))
Ono Pharmaceutical
Curated by ChEMBL
LigandPNGBDBM50033093(CHEMBL3342963)
Affinity DataIC50:  55nM. Assay description: Antagonist activity at human CysLT2 receptor expressed in HEK293 cells assessed as inhibition of LTD4-inudced intracellular calcium influx preincubat...
In DepthDetails ArticlePubMed