BDBM50035388 Benzyl-[2-(2,3-dimethoxy-phenyl)-3H-imidazol-4-ylmethyl]-methyl-amine; dihydrochloride::CHEMBL541820
SMILES COc1cccc(-c2ncc(CN(C)Cc3ccccc3)[nH]2)c1OC
InChI Key InChIKey=SPRWFPWRLMRUIZ-UHFFFAOYSA-N
Data  1 KI
  Tab Delimited (TSV)   2D SDfile   Computed 3D by Vconf -m prep SDfile
Find this compound or compounds like it in BindingDB:
Activity Spreadsheet -- Enzyme Inhibition Constant Data from BindingDB
Found 1 hit for monomerid = 50035388
TargetD(2) dopamine receptor(Cercopithecus aethiops)
Neurogen
Curated by ChEMBL
LigandPNGBDBM50035388(Benzyl-[2-(2,3-dimethoxy-phenyl)-3H-imidazol-4-ylm...)
Affinity DataKi:  5.10nM. Assay description: Displacement of [3H]YM-09151 from recombinant African green monkey Dopamine receptor D2
In DepthDetails ArticlePubMed