BDBM50035613 CHEMBL3338452
SMILES COc1ccc(CNc2nc(ncc2C(=O)c2cc(OC)c(OC)c(OC)c2)N2CCCCC2)cc1Cl
InChI Key InChIKey=LOKXLUXLHSCPNC-UHFFFAOYSA-N
Data  1 IC50
  Tab Delimited (TSV)   2D SDfile   Computed 3D by Vconf -m prep SDfile
Find this compound or compounds like it in BindingDB:
Activity Spreadsheet -- Enzyme Inhibition Constant Data from BindingDB
Found 1 hit for monomerid = 50035613
TargetcGMP-specific 3',5'-cyclic phosphodiesterase(Canis lupus familiaris)
Mitsubishi Tanabe Pharma
Curated by ChEMBL
LigandPNGBDBM50035613(CHEMBL3338452)
Affinity DataIC50:  0.740nM. Assay description: Inhibition of canine lung PDE5 using [3H]cGMP substrate by radiolabeled nucleotide method
In DepthDetails ArticlePubMed