BDBM50035789 6-Methyl-2-methylsulfanyl-4-(3-nitro-phenyl)-1,4-dihydro-pyrimidine-5-carboxylic acid methyl ester::CHEMBL282279
SMILES COC(=O)C1C(N=C(SC)N=C1C)c1cccc(c1)[N+]([O-])=O
InChI Key InChIKey=JLODCDVMKKTLDW-UHFFFAOYSA-N
Data  1 IC50  1 Kd
  Tab Delimited (TSV)   2D SDfile   Computed 3D by Vconf -m prep SDfile
Find this compound or compounds like it in BindingDB:
Activity Spreadsheet -- Enzyme Inhibition Constant Data from BindingDB
Found 2 hits for monomerid = 50035789
TargetVoltage-dependent L-type calcium channel subunit alpha-1C(Oryctolagus cuniculus)
Northwestern University
Curated by ChEMBL
LigandPNGBDBM50035789(6-Methyl-2-methylsulfanyl-4-(3-nitro-phenyl)-1,4-d...)
Affinity DataIC50:  3.29E+3nM. Assay description: Antagonist activity at rabbit voltage-dependent L-type calcium channel Cav1.2alpha-1C expressed in HEK293 cells by FLIPR assay
In DepthDetails ArticlePubMed
TargetVoltage-dependent L-type calcium channel subunit alpha-1C(Homo sapiens (Human))
Bristol-Myers Squibb Pharmaceutical Research Institute
Curated by ChEMBL
LigandPNGBDBM50035789(6-Methyl-2-methylsulfanyl-4-(3-nitro-phenyl)-1,4-d...)
Affinity DataKd:  480nM. Assay description: Displacement of [3H]nitrendipine from dihydropyridine receptor of guinea pig myocardial membranes
In DepthDetails ArticlePubMed