BDBM50036478 3-Carboxymethoxy-2,6-dichloro-benzoic acid 4-isopropyl-6-methoxy-1,1,3-trioxo-1,3-dihydro-1lambda*6*-benzo[d]isothiazol-2-ylmethyl ester::CHEMBL163414
SMILES COc1cc2c(C(=O)N(COC(=O)c3c(Cl)ccc(OCC(O)=O)c3Cl)S2(=O)=O)c(c1)C(C)C
InChI Key InChIKey=RMIJVTQGJDXSEB-UHFFFAOYSA-N
Data  1 KI
  Tab Delimited (TSV)   2D SDfile   Computed 3D by Vconf -m prep SDfile
Find this compound or compounds like it in BindingDB:
Activity Spreadsheet -- Enzyme Inhibition Constant Data from BindingDB
Found 1 hit for monomerid = 50036478
TargetNeutrophil elastase(Homo sapiens (Human))
Sterling Winthrop
Curated by ChEMBL
LigandPNGBDBM50036478(3-Carboxymethoxy-2,6-dichloro-benzoic acid 4-isopr...)
Affinity DataKi:  0.0110nM. Assay description: Potency of inhibition against human leukocyte elastase (HLE) expressed as an apparent binding constant
In DepthDetails ArticlePubMed