BDBM50040628 1-[2-(1-Benzyl-piperidin-4-yl)-ethyl]-3-(3-methoxy-benzoyl)-thiourea::CHEMBL159800
SMILES COc1cccc(c1)C(=O)NC(=S)NCCC1CCN(Cc2ccccc2)CC1
InChI Key InChIKey=ANIYWQZUXVRTEW-UHFFFAOYSA-N
Data  1 IC50
  Tab Delimited (TSV)   2D SDfile   Computed 3D by Vconf -m prep SDfile
Find this compound or compounds like it in BindingDB:
Activity Spreadsheet -- Enzyme Inhibition Constant Data from BindingDB
Found 1 hit for monomerid = 50040628
TargetAcetylcholinesterase(Rattus norvegicus (rat))
Centre De Recherche Pierre Fabre MéDicament
Curated by ChEMBL
LigandPNGBDBM50040628(1-[2-(1-Benzyl-piperidin-4-yl)-ethyl]-3-(3-methoxy...)
Affinity DataIC50:  700nM. Assay description: Inhibition against acetylcholinesterase (AChE)
In DepthDetails ArticlePubMed