BDBM50041149 (S)-2-Amino-3-(4-hydroxy-phenyl)-N-((5R,8R,15aS)-5-naphthalen-2-ylmethyl-4,7,12,15-tetraoxo-tetradecahydro-3a,6,11,14-tetraaza-cyclopentacyclotetradecen-8-yl)-propionamide::CHEMBL278889
SMILES N[C@@H](Cc1ccc(O)cc1)C(=O)N[C@@H]1CCNC(=O)CNC(=O)[C@@H]2CCCN2C(=O)[C@@H](Cc2ccc3ccccc3c2)NC1=O
InChI Key InChIKey=AKLNDWRVJOAYFT-HFLBTKGNSA-N
Data  2 KI
  Tab Delimited (TSV)   2D SDfile   Computed 3D by Vconf -m prep SDfile
Find this compound or compounds like it in BindingDB:
Activity Spreadsheet -- Enzyme Inhibition Constant Data from BindingDB
Found 1 hit for monomerid = 50041149
TargetDelta-type opioid receptor(Rattus norvegicus (rat))
Clinical Research Institute Of Montreal
Curated by ChEMBL
LigandPNGBDBM50041149((S)-2-Amino-3-(4-hydroxy-phenyl)-N-((5R,8R,15aS)-5...)
Affinity DataKi:  71nM. Assay description: Binding affinity for delta opioid receptors was determined by displacement of [3H]DSLET from rat brain membrane binding site
In DepthDetails ArticlePubMed