BDBM50041834 CHEMBL45284::N-(2-Benzoyl-phenyl)-3-cyclopentyloxy-4-methoxy-benzamide
SMILES COc1ccc(cc1OC1CCCC1)C(=O)Nc1ccccc1C(=O)c1ccccc1
InChI Key InChIKey=QUFHEZCKMOXNAW-UHFFFAOYSA-N
Data  2 IC50
  Tab Delimited (TSV)   2D SDfile   Computed 3D by Vconf -m prep SDfile
Find this compound or compounds like it in BindingDB:
Activity Spreadsheet -- Enzyme Inhibition Constant Data from BindingDB
Found 2 hits for monomerid = 50041834
Target3',5'-cyclic-AMP phosphodiesterase(Sus scrofa)
RhôNe-Poulenc Rorer
Curated by ChEMBL
LigandPNGBDBM50041834(CHEMBL45284 | N-(2-Benzoyl-phenyl)-3-cyclopentylox...)
Affinity DataIC50:  1.70E+3nM. Assay description: Inhibitory potency against pig aortic PDE IV
In DepthDetails ArticlePubMed
TargetcGMP-specific 3',5'-cyclic phosphodiesterase(Homo sapiens (Human))
RhôNe-Poulenc Rorer
Curated by ChEMBL
LigandPNGBDBM50041834(CHEMBL45284 | N-(2-Benzoyl-phenyl)-3-cyclopentylox...)
Affinity DataIC50:  2.50E+3nM. Assay description: Inhibitory potency against pig aortic PDE V.
In DepthDetails ArticlePubMed