BDBM50043799 (2R)-2-amino-3-(1H-indol-3-yl)propanoic acid::(R)-tryptophan::CHEMBL292303::D-TRYPTOPHAN
SMILES N[C@H](Cc1c[nH]c2ccccc12)C(O)=O
InChI Key InChIKey=QIVBCDIJIAJPQS-SECBINFHSA-N
Data  1 KI  2 IC50  1 Kd
PDB links: 113 PDB IDs match this monomer.
  Tab Delimited (TSV)   2D SDfile   Computed 3D by Vconf -m prep SDfile
Find this compound or compounds like it in BindingDB:
Activity Spreadsheet -- Enzyme Inhibition Constant Data from BindingDB
Found 2 hits for monomerid = 50043799
TargetStromelysin-1(Homo sapiens (Human))
Warner-Lambert
Curated by ChEMBL
LigandPNGBDBM50043799((2R)-2-amino-3-(1H-indol-3-yl)propanoic acid | (R)...)
Affinity DataIC50: >5.00E+5nM. Assay description: In vitro inhibition of recombinant stromelysin catalytic domain.
In DepthDetails ArticlePubMed
TargetLarge neutral amino acids transporter small subunit 1(Homo sapiens (Human))
University Of California
Curated by ChEMBL
LigandPNGBDBM50043799((2R)-2-amino-3-(1H-indol-3-yl)propanoic acid | (R)...)
Affinity DataIC50:  3.80E+5nM. Assay description: Cis-inhibition of human LAT1 expressed in TREx HEK293 cells at 200 uM assessed as inhibition of [3H]-gabapentin uptake preincubated for 3 mins at 37 ...
In DepthDetails ArticlePubMed