BDBM50046993 CHEMBL6322::Diethyl-carbamic acid 1,4-bis-(3,4,5-trimethoxy-benzoyl)-piperazin-2-ylmethyl ester::Diethyl-carbamic acid 1,4-bis-(3,4,5-trimethoxy-benzoyl)-piperazin-2-ylmethyl ester(PMS 601)::PMS 601
SMILES CCN(CC)C(=O)OCC1CN(CCN1C(=O)c1cc(OC)c(OC)c(OC)c1)C(=O)c1cc(OC)c(OC)c(OC)c1
InChI Key InChIKey=QKSXEJNMSRTCRE-UHFFFAOYSA-N
Data  1 IC50
  Tab Delimited (TSV)   2D SDfile   Computed 3D by Vconf -m prep SDfile
Find this compound or compounds like it in BindingDB:
Activity Spreadsheet -- Enzyme Inhibition Constant Data from BindingDB
Found 1 hit for monomerid = 50046993
TargetPlatelet-activating factor receptor(Cavia porcellus)
Universit£
Curated by ChEMBL
LigandPNGBDBM50046993(CHEMBL6322 | Diethyl-carbamic acid 1,4-bis-(3,4,5-...)
Affinity DataIC50:  2.58E+4nM. Assay description: Inhibition of PAF-induced rabbit platelet aggregation
In DepthDetails ArticlePubMed