BDBM50046997 CHEMBL6211::Octanoic acid 1,4-bis-(3,4,5-trimethoxy-benzoyl)-piperazin-2-ylmethyl ester
SMILES CCCCCCCC(=O)OCC1CN(CCN1C(=O)c1cc(OC)c(OC)c(OC)c1)C(=O)c1cc(OC)c(OC)c(OC)c1
InChI Key InChIKey=HRAVCYOABUOCGK-UHFFFAOYSA-N
Data  1 IC50
  Tab Delimited (TSV)   2D SDfile   Computed 3D by Vconf -m prep SDfile
Find this compound or compounds like it in BindingDB:
Activity Spreadsheet -- Enzyme Inhibition Constant Data from BindingDB
Found 1 hit for monomerid = 50046997
TargetPlatelet-activating factor receptor(Cavia porcellus)
Universit£
Curated by ChEMBL
LigandPNGBDBM50046997(CHEMBL6211 | Octanoic acid 1,4-bis-(3,4,5-trimetho...)
Affinity DataIC50:  310nM. Assay description: Inhibition of PAF-induced rabbit platelet aggregation
In DepthDetails ArticlePubMed