BDBM50047777 2-{[Acetyl-(3,4-bis-tetradecyloxy-benzoyl)-amino]-methyl}-1-methyl-pyridinium; iodide::CHEMBL346722
SMILES CCCCCCCCCCCCCCOc1ccc(cc1OCCCCCCCCCCCCCC)C(=O)N(Cc1cccc[n+]1C)C(C)=O
InChI Key InChIKey=VODYOCSQZOWPEN-UHFFFAOYSA-N
Data  1 IC50
  Tab Delimited (TSV)   2D SDfile   Computed 3D by Vconf -m prep SDfile
Find this compound or compounds like it in BindingDB:
Activity Spreadsheet -- Enzyme Inhibition Constant Data from BindingDB
Found 1 hit for monomerid = 50047777
TargetPlatelet-activating factor receptor(Cavia porcellus)
American Cyanamid
Curated by ChEMBL
LigandPNGBDBM50047777(2-{[Acetyl-(3,4-bis-tetradecyloxy-benzoyl)-amino]-...)
Affinity DataIC50: >1.00E+4nM. Assay description: Inhibition of PAF-induced platelet aggregation in rabbit platelet rich plasma
In DepthDetails ArticlePubMed