BDBM50047779 2-{[Acetyl-(3,4-bis-heptyloxy-benzoyl)-amino]-methyl}-1-methyl-pyridinium; iodide::CHEMBL155663
SMILES CCCCCCCOc1ccc(cc1OCCCCCCC)C(=O)N(Cc1cccc[n+]1C)C(C)=O
InChI Key InChIKey=IWOIVDFPKTWPGX-UHFFFAOYSA-N
Data  1 IC50
  Tab Delimited (TSV)   2D SDfile   Computed 3D by Vconf -m prep SDfile
Find this compound or compounds like it in BindingDB:
Activity Spreadsheet -- Enzyme Inhibition Constant Data from BindingDB
Found 1 hit for monomerid = 50047779
TargetPlatelet-activating factor receptor(Cavia porcellus)
American Cyanamid
Curated by ChEMBL
LigandPNGBDBM50047779(2-{[Acetyl-(3,4-bis-heptyloxy-benzoyl)-amino]-meth...)
Affinity DataIC50:  3.70E+3nM. Assay description: Inhibition of PAF-induced platelet aggregation in rabbit platelet rich plasma
In DepthDetails ArticlePubMed