BDBM50050094 3-Isopropyl-bicyclo[2.2.1]hept-2-ylamine::CHEMBL430112
SMILES CC(C)C1C2CCC(C2)C1N
InChI Key InChIKey=SHXVJSFOJHMEEQ-UHFFFAOYSA-N
Data  4 KI
  Tab Delimited (TSV)   2D SDfile   Computed 3D by Vconf -m prep SDfile
Find this compound or compounds like it in BindingDB:
Activity Spreadsheet -- Enzyme Inhibition Constant Data from BindingDB
Found 1 hit for monomerid = 50050094
TargetNischarin(Homo sapiens (Human))
Allergan
Curated by ChEMBL
LigandPNGBDBM50050094(3-Isopropyl-bicyclo[2.2.1]hept-2-ylamine | CHEMBL4...)
Affinity DataKi:  42nM. Assay description: Displacement of [3H]-clonidine from bovine imidazoline receptor I-1
In DepthDetails ArticlePubMed