BDBM50050209 CHEMBL22218::Pyridin-3-yl[[2,6-Bis(1-methylethyl)phenoxy]sulfonyl]carbamate
SMILES CC(C)c1cccc(C(C)C)c1OS(=O)(=O)NC(=O)Oc1cccnc1
InChI Key InChIKey=KENDPVLOFDYOSG-UHFFFAOYSA-N
Data  1 IC50
  Tab Delimited (TSV)   2D SDfile   Computed 3D by Vconf -m prep SDfile
Find this compound or compounds like it in BindingDB:
Activity Spreadsheet -- Enzyme Inhibition Constant Data from BindingDB
Found 1 hit for monomerid = 50050209
TargetSterol O-acyltransferase 1(Rattus norvegicus)
Warner-Lambert
Curated by ChEMBL
LigandPNGBDBM50050209(CHEMBL22218 | Pyridin-3-yl[[2,6-Bis(1-methylethyl)...)
Affinity DataIC50: >5.00E+4nM. Assay description: In vitro inhibitory activity against acyl coenzyme A:cholesterol acyltransferase 1 in microsomes of rat liver
In DepthDetails ArticlePubMed