BDBM50050231 2,6-[Bis(1-methyl-isopropyl)4-methyl]phenyl[[hexyloxy]sulfonyl]carbamate::CHEMBL278161
SMILES CCCCCCOS(=O)(=O)NC(=O)Oc1c(cc(C)cc1C(C)(C)C)C(C)(C)C
InChI Key InChIKey=ZTYBKWNJOSIORS-UHFFFAOYSA-N
Data  1 IC50
  Tab Delimited (TSV)   2D SDfile   Computed 3D by Vconf -m prep SDfile
Find this compound or compounds like it in BindingDB:
Activity Spreadsheet -- Enzyme Inhibition Constant Data from BindingDB
Found 1 hit for monomerid = 50050231
TargetSterol O-acyltransferase 1(Rattus norvegicus)
Warner-Lambert
Curated by ChEMBL
LigandPNGBDBM50050231(2,6-[Bis(1-methyl-isopropyl)4-methyl]phenyl[[hexyl...)
Affinity DataIC50:  9.50E+4nM. Assay description: In vitro inhibitory activity against acyl coenzyme A:cholesterol acyltransferase 1 in microsomes of rat liver
In DepthDetails ArticlePubMed