BDBM50051393 2-((R)-3-(2-Chloro-1H-indol-3-yl)-2-{2-[((2S,6R)-2,6-dimethyl-piperidine-1-carbonyl)-amino]-4-methyl-pentanoylamino}-propionylamino)-hexanoic acid::CHEMBL412602
SMILES CCCCC(NC(=O)[C@@H](Cc1c(Cl)[nH]c2ccccc12)NC(=O)C(CC(C)C)NC(=O)N1[C@@H](C)CCC[C@H]1C)C(O)=O
InChI Key InChIKey=GWMBPTBOMGCAGT-XAWXLUDDSA-N
Data  2 IC50
  Tab Delimited (TSV)   2D SDfile   Computed 3D by Vconf -m prep SDfile
Find this compound or compounds like it in BindingDB:
Activity Spreadsheet -- Enzyme Inhibition Constant Data from BindingDB
Found 2 hits for monomerid = 50051393
TargetEndothelin-1 receptor(Sus scrofa)
Tsukuba Research Institute
Curated by ChEMBL
LigandPNGBDBM50051393(2-((R)-3-(2-Chloro-1H-indol-3-yl)-2-{2-[((2S,6R)-2...)
Affinity DataIC50:  15nM. Assay description: Binding affinity towards endothelin A receptor in porcine aortic smooth muscle membranes.
In DepthDetails ArticlePubMed
TargetEndothelin receptor type B(Sus scrofa)
Tsukuba Research Institute
Curated by ChEMBL
LigandPNGBDBM50051393(2-((R)-3-(2-Chloro-1H-indol-3-yl)-2-{2-[((2S,6R)-2...)
Affinity DataIC50:  5.60nM. Assay description: Binding affinity towards endothelin B receptor in porcine cerebellum membranes
In DepthDetails ArticlePubMed