BDBM50052534 4-Phenyl-1-(4-phenyl-but-3-ynyl)-1,2,3,6-tetrahydro-pyridine::CHEMBL110324
SMILES C(CN1CCC(=CC1)c1ccccc1)C#Cc1ccccc1
InChI Key InChIKey=LVLZJQZUFDAJLN-UHFFFAOYSA-N
Data  2 KI
  Tab Delimited (TSV)   2D SDfile   Computed 3D by Vconf -m prep SDfile
Find this compound or compounds like it in BindingDB:
Activity Spreadsheet -- Enzyme Inhibition Constant Data from BindingDB
Found 2 hits for monomerid = 50052534
TargetD(2) dopamine receptor(Rattus norvegicus (rat))
Pomona College
Curated by ChEMBL
LigandPNGBDBM50052534(4-Phenyl-1-(4-phenyl-but-3-ynyl)-1,2,3,6-tetrahydr...)
Affinity DataKi:  282nM. Assay description: Binding affinity towards dopamine receptor D2 of rat striatal membrane was determined
In DepthDetails ArticlePubMed
TargetD(2) dopamine receptor(Rattus norvegicus (rat))
Pomona College
Curated by ChEMBL
LigandPNGBDBM50052534(4-Phenyl-1-(4-phenyl-but-3-ynyl)-1,2,3,6-tetrahydr...)
Affinity DataKi:  284nM. Assay description: Compound was evaluated for their affinity against dopamine receptor D2 by displacing [3H]-spiperone in rat striatal membrane
In DepthDetails ArticlePubMed