BDBM50053522 1-{7-[3-(4-Hydroxy-tetrahydro-pyran-4-yl)-benzyloxy]-4-phenyl-naphthalen-2-yl}-ethanone::CHEMBL128821
SMILES CC(=O)c1cc(-c2ccccc2)c2ccc(OCc3cccc(c3)C3(O)CCOCC3)cc2c1
InChI Key InChIKey=CTSJGJBJQLBSTN-UHFFFAOYSA-N
Data  1 IC50
  Tab Delimited (TSV)   2D SDfile   Computed 3D by Vconf -m prep SDfile
Find this compound or compounds like it in BindingDB:
Activity Spreadsheet -- Enzyme Inhibition Constant Data from BindingDB
Found 1 hit for monomerid = 50053522
TargetPolyunsaturated fatty acid 5-lipoxygenase(Homo sapiens (Human))
Merck Frosst Centre For Therapeutic Research
Curated by ChEMBL
LigandPNGBDBM50053522(1-{7-[3-(4-Hydroxy-tetrahydro-pyran-4-yl)-benzylox...)
Affinity DataIC50:  130nM. Assay description: Potency to inhibit oxidation of arachidonic acid by recombinant human 5-lipoxygenase
In DepthDetails ArticlePubMed