BDBM50053533 7-[3-(2,4-Dihydroxy-tetrahydro-pyran-4-yl)-benzyloxy]-4-phenyl-3H-naphtho[2,3-c]furan-1-one::CHEMBL420145
SMILES OC1CC(O)(CCO1)c1cccc(COc2ccc3c(c4COC(=O)c4cc3c2)-c2ccccc2)c1
InChI Key InChIKey=RTLMHTRDUPKBKK-UHFFFAOYSA-N
Data  1 IC50
  Tab Delimited (TSV)   2D SDfile   Computed 3D by Vconf -m prep SDfile
Find this compound or compounds like it in BindingDB:
Activity Spreadsheet -- Enzyme Inhibition Constant Data from BindingDB
Found 1 hit for monomerid = 50053533
TargetPolyunsaturated fatty acid 5-lipoxygenase(Homo sapiens (Human))
Merck Frosst Centre For Therapeutic Research
Curated by ChEMBL
LigandPNGBDBM50053533(7-[3-(2,4-Dihydroxy-tetrahydro-pyran-4-yl)-benzylo...)
Affinity DataIC50:  810nM. Assay description: Potency to inhibit oxidation of arachidonic acid by recombinant human 5-lipoxygenase
In DepthDetails ArticlePubMed