BDBM50053556 4-Benzyl-7-[3-(4-hydroxy-tetrahydro-pyran-4-yl)-benzyloxy]-naphthalene-2-carboxylic acid methyl ester::CHEMBL129111
SMILES COC(=O)c1cc(Cc2ccccc2)c2ccc(OCc3cccc(c3)C3(O)CCOCC3)cc2c1
InChI Key InChIKey=SWGKXYVSTXIGEA-UHFFFAOYSA-N
Data  1 IC50
  Tab Delimited (TSV)   2D SDfile   Computed 3D by Vconf -m prep SDfile
Find this compound or compounds like it in BindingDB:
Activity Spreadsheet -- Enzyme Inhibition Constant Data from BindingDB
Found 1 hit for monomerid = 50053556
TargetPolyunsaturated fatty acid 5-lipoxygenase(Homo sapiens (Human))
Merck Frosst Centre For Therapeutic Research
Curated by ChEMBL
LigandPNGBDBM50053556(4-Benzyl-7-[3-(4-hydroxy-tetrahydro-pyran-4-yl)-be...)
Affinity DataIC50: >6.00E+3nM. Assay description: Potency to inhibit oxidation of arachidonic acid by recombinant human 5-lipoxygenase
In DepthDetails ArticlePubMed