BDBM50054312 1-(2,6-Diisopropyl-phenyl)-3-(2-nonyl-2,3-dihydro-1H-tetrazol-5-yl)-urea::CHEMBL134364
SMILES CCCCCCCCCN1NN=C(NC(=O)Nc2c(cccc2C(C)C)C(C)C)N1
InChI Key InChIKey=PGDMLOCBQJOJQW-UHFFFAOYSA-N
Data  1 IC50
  Tab Delimited (TSV)   2D SDfile   Computed 3D by Vconf -m prep SDfile
Find this compound or compounds like it in BindingDB:
Activity Spreadsheet -- Enzyme Inhibition Constant Data from BindingDB
Found 1 hit for monomerid = 50054312
TargetAcyl-CoA:cholesterol acyltransferase(Oryctolagus cuniculus)
Warner-Lambert
Curated by ChEMBL
LigandPNGBDBM50054312(1-(2,6-Diisopropyl-phenyl)-3-(2-nonyl-2,3-dihydro-...)
Affinity DataIC50:  31nM. Assay description: Acyl coenzyme A:cholesterol acyltransferase 1 inhibition in vitro measured in rabbit intestinal microsomes
In DepthDetails ArticlePubMed