BDBM50055200 (S)-5-Isopropylcarbamoyloxy-1,3a,8-trimethyl-1,2,3,3a,8,8a-hexahydro-pyrrolo[2,3-b]indol-1-ium
SMILES CC(C)NC(=O)Oc1ccc2N(C)C3[N@H+](C)CC[C@@]3(C)c2c1
InChI Key InChIKey=UBUVSWQRLSPXCW-LWKPJOBUSA-O
Data  2 IC50
  Tab Delimited (TSV)   2D SDfile   Computed 3D by Vconf -m prep SDfile
Find this compound or compounds like it in BindingDB:
Activity Spreadsheet -- Enzyme Inhibition Constant Data from BindingDB
Found 2 hits for monomerid = 50055200
TargetAcetylcholinesterase(Homo sapiens (Human))
Harvard University
Curated by ChEMBL
LigandPNGBDBM50055200((S)-5-Isopropylcarbamoyloxy-1,3a,8-trimethyl-1,2,3...)
Affinity DataIC50:  3.50E+4nM. Assay description: Inhibition acetylcholinesterase (AChE) enzyme.
In DepthDetails ArticlePubMed
TargetAcetylcholinesterase(Homo sapiens (Human))
Harvard University
Curated by ChEMBL
LigandPNGBDBM50055200((S)-5-Isopropylcarbamoyloxy-1,3a,8-trimethyl-1,2,3...)
Affinity DataIC50:  3.50E+4nM. Assay description: Inhibitory activity against Acetylcholinesterase
In DepthDetails ArticlePubMed